Thread: Installation issues with Cywin/WINDOWS10

Started: 2020-11-18 07:53:21
Last activity: 2020-11-18 07:53:21
Topics: SAC Help
Edwin Obando Hernandez
2020-11-18 07:53:21

I am trying to install SAC in cywin/Window10, but I am having this error message after excuting MAKE command..

/usr/lib/gcc/x86_64-pc-cygwin/10/../../../../x86_64-pc-cygwin/bin/ld: libSMnonOracleFuncs.a(cssTableDump.o):cssTableDump.c:(.bss+0x0): multiple definition of `dblJmpBuf'; libsac_all.a(inissi.o):inissi.c:(.bss+0xa0280): first defined here
collect2: error: ld returned 1 exit status
make[1]: *** [Makefile:2966: sac.exe] Error 1
make[1]: Leaving directory '/home/obandohe/sac-101.6a/src'
make: *** [Makefile:401: all-recursive] Error 1

Could you please help me out with this?.



06:48:13 v.eb79165e